BDBM50064199 1N-benzyl-2N-[1-benzyl-4-(3-benzylcarbamoyl-2,2-dimethylcyclopropylcarboxamido)-2,3-dihydroxy-5-phenylpentyl]-3,3-dimethyl-1,2-cyclopropanedicarboxamide::CHEMBL418617
SMILES CC1(C)[C@H]([C@@H]1C(=O)N[C@@H](Cc1ccccc1)[C@@H](O)[C@H](O)[C@H](Cc1ccccc1)NC(=O)[C@H]1[C@H](C(=O)NCc2ccccc2)C1(C)C)C(=O)NCc1ccccc1
InChI Key InChIKey=XTSOTYHBCMFVQM-WIGWXFGNSA-N
Data  1 KI
  Tab Delimited (TSV)   2D SDfile   Computed 3D by Vconf -m prep SDfile
Find this compound or compounds like it in BindingDB:
Activity Spreadsheet -- Enzyme Inhibition Constant Data from BindingDB
Found 1 hit for monomerid = 50064199
TargetGag-Pol polyprotein [489-587](Human immunodeficiency virus type 1)
National Cancer Institute-Frederick
Curated by ChEMBL
LigandPNGBDBM50064199(1N-benzyl-2N-[1-benzyl-4-(3-benzylcarbamoyl-2,2-di...)
Affinity DataKi:  0.310nM. Assay description: Inhibitory activity of the compound was measured against wild-type HIV-1 protease
In DepthDetails ArticlePubMed