BDBM50064202 1N-benzyl-2N-[1-benzyl-4-(2-benzylcarbamoylcyclopropylcarboxamido)-2,3-dihydroxy-5-phenyl-(1S,2R,3R,4S)-pentyl]-1,2-cyclopropanedicarboxamide::CHEMBL287929
SMILES O[C@@H]([C@H](O)[C@H](Cc1ccccc1)NC(=O)[C@@H]1C[C@H]1C(=O)NCc1ccccc1)[C@H](Cc1ccccc1)NC(=O)[C@@H]1C[C@H]1C(=O)NCc1ccccc1
InChI Key InChIKey=OFKWXCJKTQUOHD-LAFNQVRVSA-N
Data  1 KI
  Tab Delimited (TSV)   2D SDfile   Computed 3D by Vconf -m prep SDfile
Find this compound or compounds like it in BindingDB:
Activity Spreadsheet -- Enzyme Inhibition Constant Data from BindingDB
Found 1 hit for monomerid = 50064202
TargetGag-Pol polyprotein [489-587](Human immunodeficiency virus type 1)
National Cancer Institute-Frederick
Curated by ChEMBL
LigandPNGBDBM50064202(1N-benzyl-2N-[1-benzyl-4-(2-benzylcarbamoylcyclopr...)
Affinity DataKi:  0.170nM. Assay description: Inhibitory activity of the compound was measured against wild-type HIV-1 protease
In DepthDetails ArticlePubMed