BDBM50064948 CHEMBL75864::N-(1-Benzyl-piperidin-4-yl)-2-(4-hydroxy-phenyl)-acetamide
SMILES Oc1ccc(CC(=O)NC2CCN(Cc3ccccc3)CC2)cc1
InChI Key InChIKey=ZNKNDRHZIGGRSE-UHFFFAOYSA-N
Data  1 KI
  Tab Delimited (TSV)   2D SDfile   Computed 3D by Vconf -m prep SDfile
Find this compound or compounds like it in BindingDB:
Activity Spreadsheet -- Enzyme Inhibition Constant Data from BindingDB
Found 1 hit for monomerid = 50064948
TargetSigma non-opioid intracellular receptor 1(Homo sapiens (Human))
Wake Forest University School Of Medicine
Curated by ChEMBL
LigandPNGBDBM50064948(CHEMBL75864 | N-(1-Benzyl-piperidin-4-yl)-2-(4-hyd...)
Affinity DataKi:  287nM. Assay description: Binding affinity against sigma-1 receptor in guinea pig brain membranes using [3H]-(+)-pentazocine as the radioligand
In DepthDetails ArticlePubMed