BDBM50064978 CHEMBL78059::N-(1-Benzyl-piperidin-4-yl)-2-(2,6-difluoro-phenyl)-acetamide
SMILES Fc1cccc(F)c1CC(=O)NC1CCN(Cc2ccccc2)CC1
InChI Key InChIKey=RWERTCSVUCXJDM-UHFFFAOYSA-N
Data  1 KI
  Tab Delimited (TSV)   2D SDfile   Computed 3D by Vconf -m prep SDfile
Find this compound or compounds like it in BindingDB:
Activity Spreadsheet -- Enzyme Inhibition Constant Data from BindingDB
Found 1 hit for monomerid = 50064978
TargetSigma non-opioid intracellular receptor 1(Homo sapiens (Human))
Wake Forest University School Of Medicine
Curated by ChEMBL
LigandPNGBDBM50064978(CHEMBL78059 | N-(1-Benzyl-piperidin-4-yl)-2-(2,6-d...)
Affinity DataKi:  5.80nM. Assay description: Binding affinity against sigma-1 receptor in guinea pig brain membranes using [3H]-(+)-pentazocine as the radioligand
In DepthDetails ArticlePubMed