BDBM50064981 CHEMBL77405::N-(1-Benzyl-piperidin-4-yl)-2-(3-bromo-phenyl)-acetamide
SMILES Brc1cccc(CC(=O)NC2CCN(Cc3ccccc3)CC2)c1
InChI Key InChIKey=GUOPVJSUBNXROQ-UHFFFAOYSA-N
Data  1 KI
  Tab Delimited (TSV)   2D SDfile   Computed 3D by Vconf -m prep SDfile
Find this compound or compounds like it in BindingDB:
Activity Spreadsheet -- Enzyme Inhibition Constant Data from BindingDB
Found 1 hit for monomerid = 50064981
TargetSigma non-opioid intracellular receptor 1(Homo sapiens (Human))
Wake Forest University School Of Medicine
Curated by ChEMBL
LigandPNGBDBM50064981(CHEMBL77405 | N-(1-Benzyl-piperidin-4-yl)-2-(3-bro...)
Affinity DataKi:  0.870nM. Assay description: Binding affinity against sigma-1 receptor in guinea pig brain membranes using [3H]-(+)-pentazocine as the radioligand
In DepthDetails ArticlePubMed