BDBM50064982 CHEMBL77285::N-(1-Benzyl-piperidin-4-yl)-2-(4-bromo-phenyl)-acetamide
SMILES Brc1ccc(CC(=O)NC2CCN(Cc3ccccc3)CC2)cc1
InChI Key InChIKey=PKAIJGXARQUEAV-UHFFFAOYSA-N
Data  1 KI
  Tab Delimited (TSV)   2D SDfile   Computed 3D by Vconf -m prep SDfile
Find this compound or compounds like it in BindingDB:
Activity Spreadsheet -- Enzyme Inhibition Constant Data from BindingDB
Found 1 hit for monomerid = 50064982
TargetSigma non-opioid intracellular receptor 1(Homo sapiens (Human))
Wake Forest University School Of Medicine
Curated by ChEMBL
LigandPNGBDBM50064982(CHEMBL77285 | N-(1-Benzyl-piperidin-4-yl)-2-(4-bro...)
Affinity DataKi:  3.97nM. Assay description: Binding affinity against sigma-1 receptor in guinea pig brain membranes using [3H]-(+)-pentazocine as the radioligand
In DepthDetails ArticlePubMed