BDBM50066793 CHEMBL3400533
SMILES CCN(CC)c1ccc(CCNC(=O)c2[nH]c3ccc(Cl)cc3c2CC)cc1
InChI Key InChIKey=VKCVQMODGCVRHW-UHFFFAOYSA-N
Data  1 IC50
  Tab Delimited (TSV)   2D SDfile   Computed 3D by Vconf -m prep SDfile
Find this compound or compounds like it in BindingDB:
Activity Spreadsheet -- Enzyme Inhibition Constant Data from BindingDB
Found 1 hit for monomerid = 50066793
TargetCannabinoid receptor 1(Homo sapiens (Human))
Research Triangle Institute
Curated by ChEMBL
LigandPNGBDBM50066793(CHEMBL3400533)
Affinity DataIC50:  483nM. Assay description: Antagonist activity at human CB1 receptor expressed in CHO-RD-HGA16 cells assessed as inhibition of CP55940-induced calcium mobilization incubated fo...
In DepthDetails ArticlePubMed