BDBM50066801 CHEMBL3400541
SMILES CCc1c([nH]c2ccc(Cl)cc12)C(=O)NCCc1ccc(OC)cc1
InChI Key InChIKey=RTQZKEKUXNWTAS-UHFFFAOYSA-N
Data  1 IC50
  Tab Delimited (TSV)   2D SDfile   Computed 3D by Vconf -m prep SDfile
Find this compound or compounds like it in BindingDB:
Activity Spreadsheet -- Enzyme Inhibition Constant Data from BindingDB
Found 1 hit for monomerid = 50066801
TargetCannabinoid receptor 1(Homo sapiens (Human))
Research Triangle Institute
Curated by ChEMBL
LigandPNGBDBM50066801(CHEMBL3400541)
Affinity DataIC50:  2.56E+3nM. Assay description: Antagonist activity at human CB1 receptor expressed in CHO-RD-HGA16 cells assessed as inhibition of CP55940-induced calcium mobilization incubated fo...
In DepthDetails ArticlePubMed