BDBM50067838 2'',13'',15''-trimethyl-(2''R,5'R,13''S,15''S)-dispiro[dihydro[1,3]dioxolane-4,4'-(4'H-[1,3]dioxolane)-5',14''-tetracyclo[8.7.0.02,7.011,15]heptadeca-3'',6''-diene]-5'',17''-dione::CHEMBL139463
SMILES C[C@H]1CC2C3CCC4=CC(=O)C=C[C@]4(C)C3C(=O)C[C@]2(C)[C@]11OCOC11COCO1
InChI Key InChIKey=IKTGTTLRWHGZQX-GKCKGOKFSA-N
Data  1 IC50
  Tab Delimited (TSV)   2D SDfile   Computed 3D by Vconf -m prep SDfile
Find this compound or compounds like it in BindingDB:
Activity Spreadsheet -- Enzyme Inhibition Constant Data from BindingDB
Found 1 hit for monomerid = 50067838
TargetProtein farnesyltransferase subunit beta/geranylgeranyltransferase type-1 subunit alpha(Homo sapiens (Human))
Merck Research Laboratories
Curated by ChEMBL
LigandPNGBDBM50067838(2'',13'',15''-trimethyl-(2''R,5'R,13''S,15''S)-dis...)
Affinity DataIC50:  9.60E+4nM. Assay description: inhibitory activity against human Farnesyltransferase
In DepthDetails ArticlePubMed