BDBM50068392 CHEMBL3403382
SMILES CC(=O)N1N=C(SC11C(CCN)COc2ccccc12)c1cc(F)ccc1F
InChI Key InChIKey=PAIDEOHMWDDWTK-UHFFFAOYSA-N
Data  1 EC50
  Tab Delimited (TSV)   2D SDfile   Computed 3D by Vconf -m prep SDfile
Find this compound or compounds like it in BindingDB:
Activity Spreadsheet -- Enzyme Inhibition Constant Data from BindingDB
Found 1 hit for monomerid = 50068392
TargetKinesin-like protein KIF11(Homo sapiens (Human))
Merck Research Laboratories
Curated by ChEMBL
LigandPNGBDBM50068392(CHEMBL3403382)
Affinity DataEC50:  5nM. Assay description: Inhibition of KSP in human HCT116 cells assessed as phos-histone H3 level by immunofluorescent assay
In DepthDetails ArticlePubMed