BDBM50068976 CHEMBL3402417
SMILES Brc1ccc(Br)c(c1)C(=O)OCCCCCCOc1ccc(cc1)C(=O)OC1CSSC1
InChI Key InChIKey=ORHZAHXENVKNIR-UHFFFAOYSA-N
Data  2 IC50
  Tab Delimited (TSV)   2D SDfile   Computed 3D by Vconf -m prep SDfile
Find this compound or compounds like it in BindingDB:
Activity Spreadsheet -- Enzyme Inhibition Constant Data from BindingDB
Found 2 hits for monomerid = 50068976
TargetTyrosine-protein phosphatase non-receptor type 2(Homo sapiens (Human))
Chinese Academy Of Sciences
Curated by ChEMBL
LigandPNGBDBM50068976(CHEMBL3402417)
Affinity DataIC50:  3.08E+4nM. Assay description: Inhibition of TCPTP (unknown origin)
In DepthDetails ArticlePubMed
TargetTyrosine-protein phosphatase non-receptor type 1(Homo sapiens (Human))
Chinese Academy Of Sciences
Curated by ChEMBL
LigandPNGBDBM50068976(CHEMBL3402417)
Affinity DataIC50:  8.85E+3nM. Assay description: Inhibition of PTP1B (unknown origin)
In DepthDetails ArticlePubMed