BDBM50069360 CHEMBL3402476
SMILES Cc1ccc(Cl)cc1-c1ccc([nH]1)-c1ccnc(N)n1
InChI Key InChIKey=OGDBXGMJDXGAOJ-UHFFFAOYSA-N
Data  1 IC50
  Tab Delimited (TSV)   2D SDfile   Computed 3D by Vconf -m prep SDfile
Find this compound or compounds like it in BindingDB:
Activity Spreadsheet -- Enzyme Inhibition Constant Data from BindingDB
Found 1 hit for monomerid = 50069360
TargetTyrosine-protein kinase JAK2(Homo sapiens (Human))
Nerviano Medical Sciences
Curated by ChEMBL
LigandPNGBDBM50069360(CHEMBL3402476)
Affinity DataIC50:  972nM. Assay description: Inhibition of recombinant epitope-tagged JAK2 (808 to 1132) (unknown origin) using LPLDKDYYVVREPGQ as substrate by beta-countiing analysis in presenc...
In DepthDetails ArticlePubMed