BDBM50069365 CHEMBL3330104::US9670191, F25
SMILES Cc1ccc(Cl)cc1-c1[nH]c(cc1C(N)=O)-c1ccnc(N)n1
InChI Key InChIKey=DQDASFFHMDSYAZ-UHFFFAOYSA-N
Data  4 IC50
PDB links: 1 PDB ID matches this monomer.
  Tab Delimited (TSV)   2D SDfile   Computed 3D by Vconf -m prep SDfile
Find this compound or compounds like it in BindingDB:
Activity Spreadsheet -- Enzyme Inhibition Constant Data from BindingDB
Found 4 hits for monomerid = 50069365
TargetTyrosine-protein kinase JAK2(Homo sapiens (Human))
Nerviano Medical Sciences
Curated by ChEMBL
LigandPNGBDBM50069365(CHEMBL3330104 | US9670191, F25)
Affinity DataIC50:  20nM. Assay description: Inhibition of recombinant epitope-tagged JAK2 (808 to 1132) (unknown origin) using LPLDKDYYVVREPGQ as substrate by beta-countiing analysis in presenc...
TargetTyrosine-protein kinase ABL1(Homo sapiens (Human))
Nerviano Medical Sciences
Curated by ChEMBL
LigandPNGBDBM50069365(CHEMBL3330104 | US9670191, F25)
Affinity DataIC50:  430nM. Assay description: Inhibition of JAK2 V617F mutant in human SET2 cells
In DepthDetails ArticlePubMed
TargetTyrosine-protein kinase JAK2(Homo sapiens (Human))
Nerviano Medical Sciences
Curated by ChEMBL
LigandPNGBDBM50069365(CHEMBL3330104 | US9670191, F25)
Affinity DataIC50:  20nM. Assay description: Inhibition of recombinant human JAK2 (808-1132 residues) using LPLDKDYYVVREPGQ as substrate by radiometric assay in presence of [33P]-gamma-ATP
TargetCell division cycle 7-related protein kinase [58-574]/Protein DBF4 homolog A(Homo sapiens (Human))
Nerviano Medical Sciences
US Patent
LigandPNGBDBM50069365(CHEMBL3330104 | US9670191, F25)
Affinity DataIC50: <1.00E+3nM. Assay description: The assay consists of the transfer of radioactivity labeled phosphate moiety by the kinase to an acceptor substrate. The resulting 33P-labeled produc...
In DepthDetails US Patent