BDBM50069600 (2R,3S)-N*4*-((S)-1-Carbamoyl-2-phenyl-ethyl)-N*1*-hydroxy-2-{2-[(E)-hydroxyimino]-2-phenyl-ethylsulfanylmethyl}-3-isobutyl-succinamide::CHEMBL116435
SMILES CC(C)C[C@H]([C@H](CSCC(N=O)c1ccccc1)C(=O)NO)C(=O)N[C@@H](Cc1ccccc1)C(N)=O
InChI Key InChIKey=AGXHJODGOWUDLR-ZFSMBLLKSA-N
Data  1 IC50
  Tab Delimited (TSV)   2D SDfile   Computed 3D by Vconf -m prep SDfile
Find this compound or compounds like it in BindingDB:
Activity Spreadsheet -- Enzyme Inhibition Constant Data from BindingDB
Found 1 hit for monomerid = 50069600
TargetLow affinity immunoglobulin epsilon Fc receptor(Homo sapiens (Human))
Smithkline Beecham Pharmaceuticals
Curated by ChEMBL
LigandPNGBDBM50069600((2R,3S)-N*4*-((S)-1-Carbamoyl-2-phenyl-ethyl)-N*1*...)
Affinity DataIC50:  100nM. Assay description: Inhibition against CD23 (IgE receptor) proteolysis in membranes derived from RPM18866 cells
In DepthDetails ArticlePubMed