BDBM50069746 CHEMBL3400861
SMILES C[C@@H](CO)N1C[C@H](C)[C@@H](CN(C)S(=O)(=O)c2ccc(Cl)cc2)Oc2ccc(NC(=O)Cc3cn(C)c4ccccc34)cc2C1=O
InChI Key InChIKey=DODOMVFYZBDRPB-GUARRIROSA-N
Data  1 IC50
  Tab Delimited (TSV)   2D SDfile   Computed 3D by Vconf -m prep SDfile
Find this compound or compounds like it in BindingDB:
Activity Spreadsheet -- Enzyme Inhibition Constant Data from BindingDB
Found 1 hit for monomerid = 50069746
TargetScavenger receptor class B member 1(Mus musculus)
Marquette University
Curated by ChEMBL
LigandPNGBDBM50069746(CHEMBL3400861)
Affinity DataIC50:  1.74E+4nM. Assay description: Inhibition of mouse SR-B1 overexpressed in CHO cells assessed as inhibition of transfer of the fluorescent lipid DiI from HDL particles to cells afte...
In DepthDetails ArticlePubMed