BDBM50069784 CHEMBL3407569
SMILES CC(C)(C)S(=O)(=O)C[C@H](C1CC1)N1[C@@H]([C@H](C[C@](C)(CC(=O)NC23CCC(CC2)(CC3)C(O)=O)C1=O)c1cccc(Cl)c1)c1ccc(Cl)cc1
InChI Key InChIKey=LKAFLOJDLRJSEW-BTIIEKRBSA-N
Data  2 IC50
  Tab Delimited (TSV)   2D SDfile   Computed 3D by Vconf -m prep SDfile
Find this compound or compounds like it in BindingDB:
Activity Spreadsheet -- Enzyme Inhibition Constant Data from BindingDB
Found 2 hits for monomerid = 50069784
TargetE3 ubiquitin-protein ligase Mdm2(Homo sapiens (Human))
Amgen
Curated by ChEMBL
LigandPNGBDBM50069784(CHEMBL3407569)
Affinity DataIC50:  0.700nM. Assay description: Binding affinity to human GST-thrombin-tagged MDM2 ( 1 to 188 aa) assessed as inhibition of interaction with human p53 preincubated with compound for...
In DepthDetails ArticlePubMed
TargetE3 ubiquitin-protein ligase Mdm2(Homo sapiens (Human))
Amgen
Curated by ChEMBL
LigandPNGBDBM50069784(CHEMBL3407569)
Affinity DataIC50: <0.100nM. Assay description: Binding affinity to human GST-thrombin-tagged MDM2 ( 1 to 188 aa) assessed as inhibition of interaction with human p53 preincubated with compound for...
In DepthDetails ArticlePubMed