BDBM50069964 CHEMBL324668::Sodium; 9-fluoro-5-oxo-3-phenyl-5,6-dihydro-5lambda*4*-thiochromeno[4,3-b]quinoline-7-carboxylate
SMILES [O-]C(=O)c1c2CS(=O)c3cc(ccc3-c2nc2ccc(F)cc12)-c1ccccc1
InChI Key InChIKey=NGJZQVMKSBCUMZ-UHFFFAOYSA-M
Data  1 KI
  Tab Delimited (TSV)   2D SDfile   Computed 3D by Vconf -m prep SDfile
Find this compound or compounds like it in BindingDB:
Activity Spreadsheet -- Enzyme Inhibition Constant Data from BindingDB
Found 1 hit for monomerid = 50069964
TargetDihydroorotate dehydrogenase (quinone), mitochondrial(Homo sapiens (Human))
Dupont Pharmaceuticals
Curated by ChEMBL
LigandPNGBDBM50069964(CHEMBL324668 | Sodium; 9-fluoro-5-oxo-3-phenyl-5,6...)
Affinity DataKi:  206nM. Assay description: Inhibition of human recombinant dihydroorotate dehydrogenase (DHODase)
In DepthDetails ArticlePubMed