BDBM50069971 CHEMBL105175::Sodium; 3-phenyl-9-trifluoromethyl-5,6-dihydro-benzo[c]acridine-7-carboxylate
SMILES [O-]C(=O)c1c2CCc3cc(ccc3-c2nc2ccc(cc12)C(F)(F)F)-c1ccccc1
InChI Key InChIKey=CYQSLVIPUKWXFV-UHFFFAOYSA-M
Data  1 KI
  Tab Delimited (TSV)   2D SDfile   Computed 3D by Vconf -m prep SDfile
Find this compound or compounds like it in BindingDB:
Activity Spreadsheet -- Enzyme Inhibition Constant Data from BindingDB
Found 1 hit for monomerid = 50069971
TargetDihydroorotate dehydrogenase (quinone), mitochondrial(Homo sapiens (Human))
Dupont Pharmaceuticals
Curated by ChEMBL
LigandPNGBDBM50069971(CHEMBL105175 | Sodium; 3-phenyl-9-trifluoromethyl-...)
Affinity DataKi:  31nM. Assay description: Inhibition of human recombinant dihydroorotate dehydrogenase (DHODase)
In DepthDetails ArticlePubMed