BDBM50070340 CHEMBL281025::Thiophene-2-sulfonic acid [2-(3-{[((E)-6,6-dimethyl-hept-2-en-4-ynyl)-ethyl-amino]-methyl}-phenoxy)-ethyl]-methyl-amide
SMILES CCN(C\C=C\C#CC(C)(C)C)Cc1cccc(OCCN(C)S(=O)(=O)c2cccs2)c1
InChI Key InChIKey=NEIYCJCCYGTVNA-VQHVLOKHSA-N
Data  4 IC50
  Tab Delimited (TSV)   2D SDfile   Computed 3D by Vconf -m prep SDfile
Find this compound or compounds like it in BindingDB:
Activity Spreadsheet -- Enzyme Inhibition Constant Data from BindingDB
Found 4 hits for monomerid = 50070340
TargetSqualene monooxygenase(Homo sapiens (Human))
Centre De Recherche Pierre Fabre
Curated by ChEMBL
LigandPNGBDBM50070340(CHEMBL281025 | Thiophene-2-sulfonic acid [2-(3-{[(...)
Affinity DataIC50:  50nM. Assay description: Compound was evaluated in vitro for the inhibition of pig liver squalene epoxidase in HepG2 cells
In DepthDetails ArticlePubMed
TargetSqualene monooxygenase(Homo sapiens (Human))
Centre De Recherche Pierre Fabre
Curated by ChEMBL
LigandPNGBDBM50070340(CHEMBL281025 | Thiophene-2-sulfonic acid [2-(3-{[(...)
Affinity DataIC50:  80nM. Assay description: Compound was evaluated for inhibitory activity against cholesteryl ester transfer protein, reported from fungus
In DepthDetails ArticlePubMed
TargetSqualene monooxygenase(Homo sapiens (Human))
Centre De Recherche Pierre Fabre
Curated by ChEMBL
LigandPNGBDBM50070340(CHEMBL281025 | Thiophene-2-sulfonic acid [2-(3-{[(...)
Affinity DataIC50:  60nM. Assay description: Compound was evaluated for inhibitory activity against cholesteryl ester transfer protein
In DepthDetails ArticlePubMed
TargetSqualene monooxygenase(Rattus norvegicus)
Centre De Recherche Pierre Fabre
Curated by ChEMBL
LigandPNGBDBM50070340(CHEMBL281025 | Thiophene-2-sulfonic acid [2-(3-{[(...)
Affinity DataIC50:  6.00E+3nM. Assay description: Compound was evaluated in vitro for the inhibition of rat liver squalene epoxidase in HepG2 cells
In DepthDetails ArticlePubMed