BDBM50071206 2-[4-(2'-Fluoro-biphenyl-3-ylmethyl)-piperazin-1-yl]-pyrimidine::CHEMBL291380
SMILES Fc1ccccc1-c1cccc(CN2CCN(CC2)c2ncccn2)c1
InChI Key InChIKey=MZCVVBNYRQNALN-UHFFFAOYSA-N
Data  4 IC50
  Tab Delimited (TSV)   2D SDfile   Computed 3D by Vconf -m prep SDfile
Find this compound or compounds like it in BindingDB:
Activity Spreadsheet -- Enzyme Inhibition Constant Data from BindingDB
Found 4 hits for monomerid = 50071206
TargetD(4) dopamine receptor(Homo sapiens (Human))
Darmstadt
Curated by ChEMBL
LigandPNGBDBM50071206(2-[4-(2'-Fluoro-biphenyl-3-ylmethyl)-piperazin-1-y...)
Affinity DataIC50:  8nM. Assay description: Binding affinity to cloned human Dopamine receptor D4 expressed in CHO cells using [3H]spiperone
In DepthDetails ArticlePubMed
TargetD(3) dopamine receptor(Homo sapiens (Human))
Darmstadt
Curated by ChEMBL
LigandPNGBDBM50071206(2-[4-(2'-Fluoro-biphenyl-3-ylmethyl)-piperazin-1-y...)
Affinity DataIC50:  320nM. Assay description: Binding affinity to cloned human Dopamine receptor D3 expressed in CHO cells by [3H]spiperone displacement.
In DepthDetails ArticlePubMed
Target5-hydroxytryptamine receptor 1A(Rattus norvegicus (rat))
Darmstadt
Curated by ChEMBL
LigandPNGBDBM50071206(2-[4-(2'-Fluoro-biphenyl-3-ylmethyl)-piperazin-1-y...)
Affinity DataIC50:  900nM. Assay description: Binding affinity to 5-HT1A receptor in rat hippocampus by [3H]8-OH-DPAT displacement.
In DepthDetails ArticlePubMed
TargetD(2) dopamine receptor(Homo sapiens (Human))
Darmstadt
Curated by ChEMBL
LigandPNGBDBM50071206(2-[4-(2'-Fluoro-biphenyl-3-ylmethyl)-piperazin-1-y...)
Affinity DataIC50:  250nM. Assay description: Binding affinity to cloned human Dopamine receptor D2 expressed in A9L cells by [3H]spiperone displacement.
In DepthDetails ArticlePubMed