BDBM50071222 2-[4-(9H-Fluoren-1-ylmethyl)-piperazin-1-yl]-pyrimidine::CHEMBL303519
SMILES C(N1CCN(CC1)c1ncccn1)c1cccc-2c1Cc1ccccc-21
InChI Key InChIKey=SRKMMWQNEAUSLE-UHFFFAOYSA-N
Data  4 IC50
  Tab Delimited (TSV)   2D SDfile   Computed 3D by Vconf -m prep SDfile
Find this compound or compounds like it in BindingDB:
Activity Spreadsheet -- Enzyme Inhibition Constant Data from BindingDB
Found 4 hits for monomerid = 50071222
TargetD(3) dopamine receptor(Homo sapiens (Human))
Darmstadt
Curated by ChEMBL
LigandPNGBDBM50071222(2-[4-(9H-Fluoren-1-ylmethyl)-piperazin-1-yl]-pyrim...)
Affinity DataIC50:  5.60E+3nM. Assay description: Binding affinity to cloned human Dopamine receptor D3 expressed in CHO cells by [3H]spiperone displacement.
In DepthDetails ArticlePubMed
Target5-hydroxytryptamine receptor 1A(Rattus norvegicus (rat))
Darmstadt
Curated by ChEMBL
LigandPNGBDBM50071222(2-[4-(9H-Fluoren-1-ylmethyl)-piperazin-1-yl]-pyrim...)
Affinity DataIC50: >1.00E+4nM. Assay description: Binding affinity to 5-HT1A receptor in rat hippocampus by [3H]8-OH-DPAT displacement.
In DepthDetails ArticlePubMed
TargetD(4) dopamine receptor(Homo sapiens (Human))
Darmstadt
Curated by ChEMBL
LigandPNGBDBM50071222(2-[4-(9H-Fluoren-1-ylmethyl)-piperazin-1-yl]-pyrim...)
Affinity DataIC50:  20nM. Assay description: Binding affinity to cloned human Dopamine receptor D4 expressed in CHO cells using [3H]spiperone
In DepthDetails ArticlePubMed
TargetD(2) dopamine receptor(Homo sapiens (Human))
Darmstadt
Curated by ChEMBL
LigandPNGBDBM50071222(2-[4-(9H-Fluoren-1-ylmethyl)-piperazin-1-yl]-pyrim...)
Affinity DataIC50:  9.80E+3nM. Assay description: Binding affinity to cloned human Dopamine receptor D2 expressed in A9L cells by [3H]spiperone displacement.
In DepthDetails ArticlePubMed