BDBM50072532 (6S,8aS)-4-Oxo-2-(3-phenyl-propionyl)-octahydro-pyrrolo[1,2-a]pyrazine-6-carboxylic acid [4-guanidino-1-(thiazole-2-carbonyl)-butyl]-amide::CHEMBL108691
SMILES NC(=N)NCCCC(NC(=O)[C@@H]1CC[C@H]2CN(CC(=O)N12)C(=O)CCc1ccccc1)C(=O)c1nccs1
InChI Key InChIKey=LAGUWJUZJRIYRI-WMEOFMBSSA-N
Data  1 KI
  Tab Delimited (TSV)   2D SDfile   Computed 3D by Vconf -m prep SDfile
Find this compound or compounds like it in BindingDB:
Activity Spreadsheet -- Enzyme Inhibition Constant Data from BindingDB
Found 1 hit for monomerid = 50072532
TargetProthrombin(Homo sapiens (Human))
Biochem Therapeutic
Curated by ChEMBL
LigandPNGBDBM50072532((6S,8aS)-4-Oxo-2-(3-phenyl-propionyl)-octahydro-py...)
Affinity DataKi:  0.600nM. Assay description: Binding affinity of the compound against thrombin
In DepthDetails ArticlePubMed