BDBM50072854 1-[3-(3-Carbamimidoyl-phenyl)-2-(naphthalene-2-sulfonylamino)-propionyl]-piperidine-4-carboxylic acid methyl ester::CHEMBL347493
SMILES COC(=O)C1CCN(CC1)C(=O)C(Cc1cccc(c1)C(N)=N)NS(=O)(=O)c1ccc2ccccc2c1
InChI Key InChIKey=JJLGQWCKMHPBEB-UHFFFAOYSA-N
Data  4 KI
PDB links: 1 PDB ID matches this monomer.
  Tab Delimited (TSV)   2D SDfile   Computed 3D by Vconf -m prep SDfile
Find this compound or compounds like it in BindingDB:
Activity Spreadsheet -- Enzyme Inhibition Constant Data from BindingDB
Found 1 hit for monomerid = 50072854
TargetProthrombin(Bos taurus (Bovine))
Institut FüR Biochemie
Curated by ChEMBL
LigandPNGBDBM50072854(1-[3-(3-Carbamimidoyl-phenyl)-2-(naphthalene-2-sul...)
Affinity DataKi:  17nM. Assay description: Inhibitory activity against bovine thrombin expressed as dissociation constant
In DepthDetails ArticlePubMed