BDBM50074014 1'-[2-(1-naphthyl)ethyl]spiro[3,4-dihydro-2H-chromene-2,4'-(hexahydropyridine)]-4-one::CHEMBL101869
SMILES O=C1CC2(CCN(CCc3cccc4ccccc34)CC2)Oc2ccccc12
InChI Key InChIKey=CIBARXUQAXSAER-UHFFFAOYSA-N
Data  3 KI
  Tab Delimited (TSV)   2D SDfile   Computed 3D by Vconf -m prep SDfile
Find this compound or compounds like it in BindingDB:
Activity Spreadsheet -- Enzyme Inhibition Constant Data from BindingDB
Found 3 hits for monomerid = 50074014
TargetAlpha-1B adrenergic receptor(Homo sapiens (Human))
Merck
Curated by ChEMBL
LigandPNGBDBM50074014(1'-[2-(1-naphthyl)ethyl]spiro[3,4-dihydro-2H-chrom...)
Affinity DataKi:  48nM. Assay description: Displacement of [125I]-HEAT from human Alpha-1B adrenergic receptor expressed in LM cells
In DepthDetails ArticlePubMed
TargetAlpha-1A adrenergic receptor(Homo sapiens (Human))
Merck
Curated by ChEMBL
LigandPNGBDBM50074014(1'-[2-(1-naphthyl)ethyl]spiro[3,4-dihydro-2H-chrom...)
Affinity DataKi:  53nM. Assay description: Displacement of [125I]-HEAT from human Alpha-1C adrenergic receptor expressed in CHO cells
In DepthDetails ArticlePubMed
TargetAlpha-1D adrenergic receptor(Homo sapiens (Human))
Merck
Curated by ChEMBL
LigandPNGBDBM50074014(1'-[2-(1-naphthyl)ethyl]spiro[3,4-dihydro-2H-chrom...)
Affinity DataKi:  67nM. Assay description: Displacement of [125I]-HEAT from human Alpha-1D adrenergic receptor expressed in HEK cells
In DepthDetails ArticlePubMed