BDBM50074133 CHEMBL3409912
SMILES CC(C)C[C@H](NC(=O)[C@H](CC(C)C)NC(=O)N1CCOCC1)C(=O)N[C@@H](Cc1ccccc1)C(=O)N1CCC[C@H]1COc1ccc(F)cc1
InChI Key InChIKey=IPOPOZZXEMGNDY-BBXFGWPUSA-N
Data  1 KI
  Tab Delimited (TSV)   2D SDfile   Computed 3D by Vconf -m prep SDfile
Find this compound or compounds like it in BindingDB:
Activity Spreadsheet -- Enzyme Inhibition Constant Data from BindingDB
Found 1 hit for monomerid = 50074133
TargetFalcipain 2(Plasmodium falciparum)
University Of Toronto
Curated by ChEMBL
LigandPNGBDBM50074133(CHEMBL3409912)
Affinity DataKi:  300nM. Assay description: Inhibition of Plasmodium falciparum recombinant falcipain-2 using ZFR-AMC as substrate after 30 mins by fluorometric assay
In DepthDetails ArticlePubMed