BDBM50074135 CHEMBL3409910
SMILES CC(C)C[C@H](NC(=O)CN1CCN(C)CC1)C(=O)N[C@@H](CC(C)C)C(=O)N[C@H](C(=O)N1CCC[C@H]1COc1ccc(F)cc1)c1ccccc1
InChI Key InChIKey=DQCLUQFCIFFFCW-GCWKJIDRSA-N
Data  1 KI
  Tab Delimited (TSV)   2D SDfile   Computed 3D by Vconf -m prep SDfile
Find this compound or compounds like it in BindingDB:
Activity Spreadsheet -- Enzyme Inhibition Constant Data from BindingDB
Found 1 hit for monomerid = 50074135
TargetFalcipain 2(Plasmodium falciparum)
University Of Toronto
Curated by ChEMBL
LigandPNGBDBM50074135(CHEMBL3409910)
Affinity DataKi: >1.00E+4nM. Assay description: Inhibition of Plasmodium falciparum recombinant falcipain-2 using ZFR-AMC as substrate after 30 mins by fluorometric assay
In DepthDetails ArticlePubMed