BDBM50074981 (E)-N-({[2,4-Dimethoxy-3-(2-methyl-quinolin-8-yloxymethyl)-phenyl]-methyl-carbamoyl}-methyl)-3-m-tolyl-acrylamide::CHEMBL112360
SMILES COc1ccc(N(C)C(=O)CNC(=O)\C=C\c2cccc(C)c2)c(OC)c1COc1cccc2ccc(C)nc12
InChI Key InChIKey=BAAOCYOMRORTSI-GHRIWEEISA-N
Data  1 KI  1 IC50
  Tab Delimited (TSV)   2D SDfile   Computed 3D by Vconf -m prep SDfile
Find this compound or compounds like it in BindingDB:
Activity Spreadsheet -- Enzyme Inhibition Constant Data from BindingDB
Found 2 hits for monomerid = 50074981
TargetB2 bradykinin receptor(Cavia porcellus)
Hoechst Marion Roussel
Curated by ChEMBL
LigandPNGBDBM50074981((E)-N-({[2,4-Dimethoxy-3-(2-methyl-quinolin-8-ylox...)
Affinity DataKi:  9.20nM. Assay description: Inhibition of BK-induced (4x10E-8M) contraction of isolated guinea pig ileum (GPI)
In DepthDetails ArticlePubMed
TargetB2 bradykinin receptor(Cavia porcellus)
Hoechst Marion Roussel
Curated by ChEMBL
LigandPNGBDBM50074981((E)-N-({[2,4-Dimethoxy-3-(2-methyl-quinolin-8-ylox...)
Affinity DataIC50:  81nM. Assay description: Inhibition of specific binding of [3H]-BK to bradykinin B2 receptors of guinea pig ileum (GPI)
In DepthDetails ArticlePubMed