BDBM50076674 CHEMBL177772::Sodium; (2S,5R,6S)-6-((S)-1-hydroxy-ethyl)-3,3-dimethyl-4,4,7-trioxo-4lambda*6*-thia-1-aza-bicyclo[3.2.0]heptane-2-carboxylate
SMILES C[C@H](O)[C@@H]1[C@@H]2N([C@@H](C([O-])=O)C(C)(C)S2(=O)=O)C1=O
InChI Key InChIKey=JWBKZXUHEFRKRV-VUBPFVNUSA-M
Data  2 IC50
  Tab Delimited (TSV)   2D SDfile   Computed 3D by Vconf -m prep SDfile
Find this compound or compounds like it in BindingDB:
Activity Spreadsheet -- Enzyme Inhibition Constant Data from BindingDB
Found 1 hit for monomerid = 50076674
TargetBeta-lactamase(Escherichia coli)
Wyeth-Ayerst Research
Curated by ChEMBL
LigandPNGBDBM50076674(CHEMBL177772 | Sodium; (2S,5R,6S)-6-((S)-1-hydroxy...)
Affinity DataIC50:  1.60E+3nM. Assay description: Inhibitory activity of the compound against AmpC (class C) beta-lactamase
In DepthDetails ArticlePubMed