BDBM50077002 3-[4-(5-Methyl-4-phenyl-pyrazol-1-yl)-piperidin-1-ylmethyl]-benzonitrile::CHEMBL24052
SMILES Cc1c(cnn1C1CCN(Cc2cccc(c2)C#N)CC1)-c1ccccc1
InChI Key InChIKey=FBJIUWHTOIOHGN-UHFFFAOYSA-N
Data  3 KI
  Tab Delimited (TSV)   2D SDfile   Computed 3D by Vconf -m prep SDfile
Find this compound or compounds like it in BindingDB:
Activity Spreadsheet -- Enzyme Inhibition Constant Data from BindingDB
Found 3 hits for monomerid = 50077002
TargetD(4) dopamine receptor(Homo sapiens (Human))
Merck Sharp And Dohme Research Laboratories
Curated by ChEMBL
LigandPNGBDBM50077002(3-[4-(5-Methyl-4-phenyl-pyrazol-1-yl)-piperidin-1-...)
Affinity DataKi:  5.20nM. Assay description: Displacement of [3H]-spiperone from human Dopamine receptor D4 expressed in HEK-293 cells
In DepthDetails ArticlePubMed
TargetD(2) dopamine receptor(Homo sapiens (Human))
Merck Sharp And Dohme Research Laboratories
Curated by ChEMBL
LigandPNGBDBM50077002(3-[4-(5-Methyl-4-phenyl-pyrazol-1-yl)-piperidin-1-...)
Affinity DataKi: >1.70E+3nM. Assay description: Displacement of [3H]-spiperone from human Dopamine receptor D2 expressed in CHO cells
In DepthDetails ArticlePubMed
TargetD(3) dopamine receptor(Homo sapiens (Human))
Merck Sharp And Dohme Research Laboratories
Curated by ChEMBL
LigandPNGBDBM50077002(3-[4-(5-Methyl-4-phenyl-pyrazol-1-yl)-piperidin-1-...)
Affinity DataKi:  4.40E+3nM. Assay description: Displacement of [3H]-spiperone from human Dopamine receptor D3 expressed in HEK-293 cells
In DepthDetails ArticlePubMed