BDBM50077004 1-(3-Chloro-benzyl)-4-(3-methyl-4-phenyl-pyrazol-1-yl)-piperidine::CHEMBL287412
SMILES Cc1nn(cc1-c1ccccc1)C1CCN(Cc2cccc(Cl)c2)CC1
InChI Key InChIKey=UGAZJRFHXXPSOK-UHFFFAOYSA-N
Data  3 KI
  Tab Delimited (TSV)   2D SDfile   Computed 3D by Vconf -m prep SDfile
Find this compound or compounds like it in BindingDB:
Activity Spreadsheet -- Enzyme Inhibition Constant Data from BindingDB
Found 3 hits for monomerid = 50077004
TargetD(4) dopamine receptor(Homo sapiens (Human))
Merck Sharp And Dohme Research Laboratories
Curated by ChEMBL
LigandPNGBDBM50077004(1-(3-Chloro-benzyl)-4-(3-methyl-4-phenyl-pyrazol-1...)
Affinity DataKi:  3.10nM. Assay description: Displacement of [3H]-spiperone from human Dopamine receptor D4 expressed in HEK-293 cells
In DepthDetails ArticlePubMed
TargetD(2) dopamine receptor(Homo sapiens (Human))
Merck Sharp And Dohme Research Laboratories
Curated by ChEMBL
LigandPNGBDBM50077004(1-(3-Chloro-benzyl)-4-(3-methyl-4-phenyl-pyrazol-1...)
Affinity DataKi:  15nM. Assay description: Displacement of [3H]-spiperone from human Dopamine receptor D2 expressed in CHO cells
In DepthDetails ArticlePubMed
TargetD(3) dopamine receptor(Homo sapiens (Human))
Merck Sharp And Dohme Research Laboratories
Curated by ChEMBL
LigandPNGBDBM50077004(1-(3-Chloro-benzyl)-4-(3-methyl-4-phenyl-pyrazol-1...)
Affinity DataKi:  120nM. Assay description: Displacement of [3H]-spiperone from human Dopamine receptor D3 expressed in HEK-293 cells
In DepthDetails ArticlePubMed