BDBM50077199 (S)-4-{(S)-2-Acetylamino-3-[4-(oxalyl-amino)-phenyl]-propionylamino}-4-(4-methoxy-benzylcarbamoyl)-butyric acid::CHEMBL51837
SMILES COc1ccc(CNC(=O)[C@H](CCC(O)=O)NC(=O)[C@H](Cc2ccc(NC(=O)C(O)=O)cc2)NC(C)=O)cc1
InChI Key InChIKey=ZENZFQAEXRWVMB-SFTDATJTSA-N
Data  1 Kd
  Tab Delimited (TSV)   2D SDfile   Computed 3D by Vconf -m prep SDfile
Find this compound or compounds like it in BindingDB:
Activity Spreadsheet -- Enzyme Inhibition Constant Data from BindingDB
Found 1 hit for monomerid = 50077199
TargetTyrosine-protein kinase Lck(Homo sapiens (Human))
Boehringer Ingelheim Pharmaceuticals
Curated by ChEMBL
LigandPNGBDBM50077199((S)-4-{(S)-2-Acetylamino-3-[4-(oxalyl-amino)-pheny...)
Affinity DataKd:  4.20E+4nM. Assay description: Binding affinity towards p56 Lck tyrosine kinase SH2 domain was determined by biological assay
In DepthDetails ArticlePubMed