BDBM50077208 (S)-4-(4-Methoxy-benzylcarbamoyl)-4-[(S)-2-(2-naphthalen-1-yl-acetylamino)-3-(4-phosphonooxy-phenyl)-propionylamino]-butyric acid::CHEMBL50965
SMILES COc1ccc(CNC(=O)[C@H](CCC(O)=O)NC(=O)[C@H](Cc2ccc(OP(O)(O)=O)cc2)NC(=O)Cc2cccc3ccccc23)cc1
InChI Key InChIKey=IVZVYUSWMFIOEN-KYJUHHDHSA-N
Data  1 Kd
  Tab Delimited (TSV)   2D SDfile   Computed 3D by Vconf -m prep SDfile
Find this compound or compounds like it in BindingDB:
Activity Spreadsheet -- Enzyme Inhibition Constant Data from BindingDB
Found 1 hit for monomerid = 50077208
TargetTyrosine-protein kinase Lck(Homo sapiens (Human))
Boehringer Ingelheim Pharmaceuticals
Curated by ChEMBL
LigandPNGBDBM50077208((S)-4-(4-Methoxy-benzylcarbamoyl)-4-[(S)-2-(2-naph...)
Affinity DataKd:  40nM. Assay description: Binding affinity towards p56 Lck tyrosine kinase SH2 domain was determined by biological assay
In DepthDetails ArticlePubMed