BDBM50078569 (S)-4-(Biphenyl-4-ylmethylsulfanyl)-N-hydroxy-2-[isobutyl-(4-methoxy-benzenesulfonyl)-amino]-butyramide::CHEMBL296761
SMILES COc1ccc(cc1)S(=O)(=O)N(CC(C)C)[C@@H](CCSCc1ccc(cc1)-c1ccccc1)C(=O)NO
InChI Key InChIKey=IQVPRIHMNPAIMY-MHZLTWQESA-N
Data  3 IC50
  Tab Delimited (TSV)   2D SDfile   Computed 3D by Vconf -m prep SDfile
Find this compound or compounds like it in BindingDB:
Activity Spreadsheet -- Enzyme Inhibition Constant Data from BindingDB
Found 3 hits for monomerid = 50078569
Target72 kDa type IV collagenase(Homo sapiens (Human))
Universit£
Curated by ChEMBL
LigandPNGBDBM50078569((S)-4-(Biphenyl-4-ylmethylsulfanyl)-N-hydroxy-2-[i...)
Affinity DataIC50:  30nM. Assay description: Inhibition of matrix metalloprotease-2
In DepthDetails ArticlePubMed
TargetStromelysin-1(Homo sapiens (Human))
Universit£
Curated by ChEMBL
LigandPNGBDBM50078569((S)-4-(Biphenyl-4-ylmethylsulfanyl)-N-hydroxy-2-[i...)
Affinity DataIC50:  20nM. Assay description: Inhibition of matrix metalloprotease-3
In DepthDetails ArticlePubMed
TargetMatrix metalloproteinase-9(Homo sapiens (Human))
Universit£
Curated by ChEMBL
LigandPNGBDBM50078569((S)-4-(Biphenyl-4-ylmethylsulfanyl)-N-hydroxy-2-[i...)
Affinity DataIC50:  0.200nM. Assay description: Inhibition of matrix metalloprotease-9
In DepthDetails ArticlePubMed