BDBM50080058 1-[(Z)-2-Cyclooctyloxy-2-(2,4-dichloro-phenyl)-vinyl]-1H-[1,2,4]triazole::CHEMBL68739
SMILES Clc1ccc(\C(OC2CCCCCCC2)=C\n2cncn2)c(Cl)c1
InChI Key InChIKey=BEPANIVQPGBOQX-WQRHYEAKSA-N
Data  1 IC50
  Tab Delimited (TSV)   2D SDfile   Computed 3D by Vconf -m prep SDfile
Find this compound or compounds like it in BindingDB:
Activity Spreadsheet -- Enzyme Inhibition Constant Data from BindingDB
Found 1 hit for monomerid = 50080058
TargetMetabotropic glutamate receptor 2(Homo sapiens (Human))
F. Hoffmann-La Roche
Curated by ChEMBL
LigandPNGBDBM50080058(1-[(Z)-2-Cyclooctyloxy-2-(2,4-dichloro-phenyl)-vin...)
Affinity DataIC50:  1.21E+3nM. Assay description: Inhibition of 10 uM 1S, 3R-ACPD stimulated GTP gamma 35S binding to rat mGluR2 expressed in CHO cells
In DepthDetails ArticlePubMed