BDBM50080424 CHEMBL3422264
SMILES [H][C@@]12[C@@H](CC(=O)[C@@]1(C)[C@]1(C)CC[C@@]3([H])C(C)(C)[C@@H](O)CC[C@]3(C)[C@@]1([H])C[C@H]2O)OC
InChI Key InChIKey=ZENVSCKOBKOTSJ-RTFSNDOKSA-N
Data  4 IC50
  Tab Delimited (TSV)   2D SDfile   Computed 3D by Vconf -m prep SDfile
Find this compound or compounds like it in BindingDB:
Activity Spreadsheet -- Enzyme Inhibition Constant Data from BindingDB
Found 4 hits for monomerid = 50080424
Target11-beta-hydroxysteroid dehydrogenase type 2(Homo sapiens (Human))
Chinese Academy Of Sciences
Curated by ChEMBL
LigandPNGBDBM50080424(CHEMBL3422264)
Affinity DataIC50:  2.55E+4nM. Assay description: Inhibition of human 11beta-HSD2 overexpressed in microsomal fraction of HEK293 cells using [3H]-cortisol as substrate by scintillation proximity assa...
In DepthDetails ArticlePubMed
Target11-beta-hydroxysteroid dehydrogenase type 2(Mus musculus (mouse))
Chinese Academy Of Sciences
Curated by ChEMBL
LigandPNGBDBM50080424(CHEMBL3422264)
Affinity DataIC50:  2.92E+5nM. Assay description: Inhibition of mouse 11beta-HSD2 overexpressed in microsomal fraction of HEK293 cells using [3H]-cortisol as substrate by scintillation proximity assa...
In DepthDetails ArticlePubMed
Target11-beta-hydroxysteroid dehydrogenase 1(Mus musculus (mouse))
Chinese Academy Of Sciences
Curated by ChEMBL
LigandPNGBDBM50080424(CHEMBL3422264)
Affinity DataIC50:  2.80E+3nM. Assay description: Inhibition of mouse 11beta-HSD1 overexpressed in microsomal fraction of HEK293 cells assessed as formation of [3H]-cortisol from [3H]-cortisone by sc...
In DepthDetails ArticlePubMed
Target11-beta-hydroxysteroid dehydrogenase 1(Homo sapiens (Human))
Chinese Academy Of Sciences
Curated by ChEMBL
LigandPNGBDBM50080424(CHEMBL3422264)
Affinity DataIC50:  195nM. Assay description: Inhibition of human 11beta-HSD1 overexpressed in microsomal fraction of HEK293 cells assessed as formation of [3H]-cortisol from [3H]-cortisone by sc...
In DepthDetails ArticlePubMed