BDBM50081090 CHEMBL87502::N-((S)-1-Carbamimidoyl-2-hydroxy-piperidin-3-yl)-2-((S)-6-methoxy-2-oxo-3-phenylmethanesulfonylamino-2,3,4,5-tetrahydro-benzo[b]azepin-1-yl)-acetamide; TFA
SMILES COc1cccc2N(CC(=O)N[C@H]3CCCN(C3O)C(N)=N)C(=O)[C@H](CCc12)NS(=O)(=O)Cc1ccccc1
InChI Key InChIKey=BZIOCUVNHKVFDQ-ZRENRBBTSA-N
Data  5 IC50
  Tab Delimited (TSV)   2D SDfile   Computed 3D by Vconf -m prep SDfile
Find this compound or compounds like it in BindingDB:
Activity Spreadsheet -- Enzyme Inhibition Constant Data from BindingDB
Found 5 hits for monomerid = 50081090
TargetCoagulation factor X(Homo sapiens (Human))
Corvas International
Curated by ChEMBL
LigandPNGBDBM50081090(CHEMBL87502 | N-((S)-1-Carbamimidoyl-2-hydroxy-pip...)
Affinity DataIC50:  27nM. Assay description: In vitro inhibitory activity against human prothrombinase
In DepthDetails ArticlePubMed
TargetSerine protease 1(Homo sapiens (Human))
Corvas International
Curated by ChEMBL
LigandPNGBDBM50081090(CHEMBL87502 | N-((S)-1-Carbamimidoyl-2-hydroxy-pip...)
Affinity DataIC50:  77nM. Assay description: In vitro evaluation of inhibition of cleavage of the chromogenic substrate by human enzyme trypsin
In DepthDetails ArticlePubMed
TargetCoagulation factor X(Homo sapiens (Human))
Corvas International
Curated by ChEMBL
LigandPNGBDBM50081090(CHEMBL87502 | N-((S)-1-Carbamimidoyl-2-hydroxy-pip...)
Affinity DataIC50:  8.60nM. Assay description: In vitro inhibitory activity of the compound against human enzyme Coagulation factor X
In DepthDetails ArticlePubMed
TargetPlasminogen(Homo sapiens (Human))
Corvas International
Curated by ChEMBL
LigandPNGBDBM50081090(CHEMBL87502 | N-((S)-1-Carbamimidoyl-2-hydroxy-pip...)
Affinity DataIC50: >2.50E+3nM. Assay description: In vitro inhibitory activity of the compound against human enzyme plasmin
In DepthDetails ArticlePubMed
TargetProthrombin(Homo sapiens (Human))
Corvas International
Curated by ChEMBL
LigandPNGBDBM50081090(CHEMBL87502 | N-((S)-1-Carbamimidoyl-2-hydroxy-pip...)
Affinity DataIC50:  235nM. Assay description: In vitro inhibitory activity of the compound against human enzyme thrombin
In DepthDetails ArticlePubMed