BDBM50082024 2-{2-[3-(7-Chloro-4-hydroxy-2-oxo-1,2-dihydro-quinolin-3-yl)-phenoxy]-phenylamino}-ethanesulfonyl fluoride::CHEMBL337851
SMILES Oc1c(-c2cccc(Oc3ccccc3NCCS(F)(=O)=O)c2)c(=O)[nH]c2cc(Cl)ccc12
InChI Key InChIKey=RFXVWSJEAZEHDH-UHFFFAOYSA-N
Data  1 KI  1 IC50
  Tab Delimited (TSV)   2D SDfile   Computed 3D by Vconf -m prep SDfile
Find this compound or compounds like it in BindingDB:
Activity Spreadsheet -- Enzyme Inhibition Constant Data from BindingDB
Found 2 hits for monomerid = 50082024
TargetGlutamate receptor ionotropic, NMDA 1(RAT)
Université
Curated by ChEMBL
LigandPNGBDBM50082024(2-{2-[3-(7-Chloro-4-hydroxy-2-oxo-1,2-dihydro-quin...)
Affinity DataKi:  26.8nM. Assay description: Displacement of [3H]-5-7 dichlorokynurenic acid ([3H]- DCKA) from N-methyl-D-aspartate glutamate receptor glycine site of rat brain membrane homogen...
In DepthDetails ArticlePubMed
TargetGlutamate receptor ionotropic, NMDA 1/2B(Rattus norvegicus (Rat))
Université
Curated by ChEMBL
LigandPNGBDBM50082024(2-{2-[3-(7-Chloro-4-hydroxy-2-oxo-1,2-dihydro-quin...)
Affinity DataIC50:  32nM. Assay description: Antagonistic activity for suppression of membrane current response elicited by fixed concentration of glycine and glutamate in Xenopus oocyte express...
In DepthDetails ArticlePubMed