BDBM50082396 (4R,5S,6S,7R)-1-(3-Amino-benzyl)-4,7-dibenzyl-5,6-dihydroxy-3-[3-(3-methoxy-phenyl)-1H-indazol-5-ylmethyl]-[1,3]diazepan-2-one::CHEMBL321669
SMILES COc1cccc(c1)-c1n[nH]c2ccc(CN3[C@H](Cc4ccccc4)[C@H](O)[C@@H](O)[C@@H](Cc4ccccc4)N(Cc4cccc(N)c4)C3=O)cc12
InChI Key InChIKey=DOYLRRXQCZFMEN-QQGWDPLKSA-N
Data  1 KI
  Tab Delimited (TSV)   2D SDfile   Computed 3D by Vconf -m prep SDfile
Find this compound or compounds like it in BindingDB:
Activity Spreadsheet -- Enzyme Inhibition Constant Data from BindingDB
Found 1 hit for monomerid = 50082396
TargetGag-Pol polyprotein [489-587](Human immunodeficiency virus type 1)
Dupont Pharmaceuticals
Curated by ChEMBL
LigandPNGBDBM50082396((4R,5S,6S,7R)-1-(3-Amino-benzyl)-4,7-dibenzyl-5,6-...)
Affinity DataKi:  0.240nM. Assay description: Binding affinity for HIV -1 Protease
In DepthDetails ArticlePubMed