BDBM50082964 (2R,3S)-2-Cyclopentyl-N*4*-((S)-2,2-dimethyl-1-methylcarbamoyl-propyl)-N*1*-hydroxy-3-isobutyl-succinamide::CHEMBL29976
SMILES CNC(=O)[C@@H](NC(=O)[C@H](CC(C)C)[C@H](C1CCCC1)C(=O)NO)C(C)(C)C
InChI Key InChIKey=QXLMMZHXXOWCDY-OWCLPIDISA-N
Data  4 IC50
  Tab Delimited (TSV)   2D SDfile   Computed 3D by Vconf -m prep SDfile
Find this compound or compounds like it in BindingDB:
Activity Spreadsheet -- Enzyme Inhibition Constant Data from BindingDB
Found 4 hits for monomerid = 50082964
TargetNeutrophil collagenase(Homo sapiens (Human))
Astrazeneca
Curated by ChEMBL
LigandPNGBDBM50082964((2R,3S)-2-Cyclopentyl-N*4*-((S)-2,2-dimethyl-1-met...)
Affinity DataIC50:  20nM. Assay description: Inhibition of MMP-8 (matrix metalloproteinase-8)
In DepthDetails ArticlePubMed
TargetInterstitial collagenase(Homo sapiens (Human))
Astrazeneca
Curated by ChEMBL
LigandPNGBDBM50082964((2R,3S)-2-Cyclopentyl-N*4*-((S)-2,2-dimethyl-1-met...)
Affinity DataIC50:  4nM. Assay description: Inhibitory activity against MMP-1 (Matrix metalloproteinase-1)
In DepthDetails ArticlePubMed
TargetDisintegrin and metalloproteinase domain-containing protein 17(Homo sapiens (Human))
Astrazeneca
Curated by ChEMBL
LigandPNGBDBM50082964((2R,3S)-2-Cyclopentyl-N*4*-((S)-2,2-dimethyl-1-met...)
Affinity DataIC50:  8.80E+3nM. Assay description: Inhibition of TNF(tumor necrosis factor) in human blood
In DepthDetails ArticlePubMed
TargetDisintegrin and metalloproteinase domain-containing protein 17(Homo sapiens (Human))
Astrazeneca
Curated by ChEMBL
LigandPNGBDBM50082964((2R,3S)-2-Cyclopentyl-N*4*-((S)-2,2-dimethyl-1-met...)
Affinity DataIC50:  1nM. Assay description: Inhibitory activity against Tumor necrosis factor alpha-converting enzyme (TACE) in blood.
In DepthDetails ArticlePubMed