BDBM50082983 (2R,3S)-N*1*-((S)-2,2-Dimethyl-1-methylcarbamoyl-propyl)-N*4*-hydroxy-2-isobutyl-3-(quinolin-8-ylmethoxy)-succinamide::CHEMBL144188
SMILES CNC(=O)[C@@H](NC(=O)[C@H](CC(C)C)[C@H](OCc1cccc2cccnc12)C(=O)NO)C(C)(C)C
InChI Key InChIKey=BRZXSVRUJXSSFG-HLAWJBBLSA-N
Data  2 IC50
  Tab Delimited (TSV)   2D SDfile   Computed 3D by Vconf -m prep SDfile
Find this compound or compounds like it in BindingDB:
Activity Spreadsheet -- Enzyme Inhibition Constant Data from BindingDB
Found 2 hits for monomerid = 50082983
TargetDisintegrin and metalloproteinase domain-containing protein 17(Homo sapiens (Human))
Astrazeneca
Curated by ChEMBL
LigandPNGBDBM50082983((2R,3S)-N*1*-((S)-2,2-Dimethyl-1-methylcarbamoyl-p...)
Affinity DataIC50:  0.400nM. Assay description: Inhibitory activity against Tumor necrosis factor alpha-converting enzyme (TACE) in blood.
In DepthDetails ArticlePubMed
TargetDisintegrin and metalloproteinase domain-containing protein 17(Homo sapiens (Human))
Astrazeneca
Curated by ChEMBL
LigandPNGBDBM50082983((2R,3S)-N*1*-((S)-2,2-Dimethyl-1-methylcarbamoyl-p...)
Affinity DataIC50:  8.20E+3nM. Assay description: Inhibition of TNF(tumor necrosis factor) in human blood
In DepthDetails ArticlePubMed