BDBM50083479 (R)-5-Phenyl-3-{[(R)-1-(3-piperidin-4-yl-propionyl)-piperidine-3-carbonyl]-amino}-pent-4-ynoic acid::CHEMBL151808
SMILES OC(=O)C[C@@H](NC(=O)[C@@H]1CCCN(C1)C(=O)CCC1CCNCC1)C#Cc1ccccc1
InChI Key InChIKey=AFEBUYQIVROWSL-YADHBBJMSA-N
Data  1 IC50
  Tab Delimited (TSV)   2D SDfile   Computed 3D by Vconf -m prep SDfile
Find this compound or compounds like it in BindingDB:
Activity Spreadsheet -- Enzyme Inhibition Constant Data from BindingDB
Found 1 hit for monomerid = 50083479
TargetIntegrin alpha-IIb/beta-3(Homo sapiens (Human))
The R. W. Johnson Pharmaceutical Research Institute
Curated by ChEMBL
LigandPNGBDBM50083479((R)-5-Phenyl-3-{[(R)-1-(3-piperidin-4-yl-propionyl...)
Affinity DataIC50:  0.220nM. Assay description: In vitro inhibition of biotinylated fibrinogen binding to immobolized fibrinogen receptor.
In DepthDetails ArticlePubMed