BDBM50084595 2,6-Diisopropyl-4-phenyl-1-[(2-sulfamoyl-benzothiazol-6-ylcarbamoyl)-methyl]-pyridinium; perchlorate::CHEMBL420105
SMILES CC(C)c1cc(cc(C(C)C)[n+]1CC(=O)Nc1ccc2nc(sc2c1)S(N)(=O)=O)-c1ccccc1
InChI Key InChIKey=VNWPVBNZAZUCPR-UHFFFAOYSA-O
Data  3 KI
  Tab Delimited (TSV)   2D SDfile   Computed 3D by Vconf -m prep SDfile
Find this compound or compounds like it in BindingDB:
Activity Spreadsheet -- Enzyme Inhibition Constant Data from BindingDB
Found 3 hits for monomerid = 50084595
TargetCarbonic anhydrase 2(Homo sapiens (Human))
Università
Curated by ChEMBL
LigandPNGBDBM50084595(2,6-Diisopropyl-4-phenyl-1-[(2-sulfamoyl-benzothia...)
Affinity DataKi:  8nM. Assay description: Inhibitory activity against human carbonic anhydrase II (CA2)
In DepthDetails ArticlePubMed
TargetCarbonic anhydrase 1(Homo sapiens (Human))
Università
Curated by ChEMBL
LigandPNGBDBM50084595(2,6-Diisopropyl-4-phenyl-1-[(2-sulfamoyl-benzothia...)
Affinity DataKi:  13nM. Assay description: Inhibitory activity against human carbonic anhydrase I (CA1)
In DepthDetails ArticlePubMed
TargetCarbonic anhydrase 4(Bos taurus (bovine))
Università
Curated by ChEMBL
LigandPNGBDBM50084595(2,6-Diisopropyl-4-phenyl-1-[(2-sulfamoyl-benzothia...)
Affinity DataKi:  38nM. Assay description: Inhibitory activity against bovine carbonic anhydrase IV (CA4), isolated from bovine lung microsomes
In DepthDetails ArticlePubMed