BDBM50084631 CHEMBL3427203
SMILES COc1nc(-c2ccc(OC)cc2)n(n1)-c1ccc(OC)cc1
InChI Key InChIKey=OBAICMYWONZOSZ-UHFFFAOYSA-N
Data  6 IC50
  Tab Delimited (TSV)   2D SDfile   Computed 3D by Vconf -m prep SDfile
Find this compound or compounds like it in BindingDB:
Activity Spreadsheet -- Enzyme Inhibition Constant Data from BindingDB
Found 6 hits for monomerid = 50084631
TargetProstaglandin G/H synthase 1(Homo sapiens (Human))
Universit£
Curated by ChEMBL
LigandPNGBDBM50084631(CHEMBL3427203)
Affinity DataIC50:  4.90nM. Assay description: Inhibition of LPS-induced COX1 in human whole blood assessed as reduction in TXB2 levels by radioimmunoassay
In DepthDetails ArticlePubMed
TargetProstaglandin G/H synthase 2(Homo sapiens (Human))
Universit£
Curated by ChEMBL
LigandPNGBDBM50084631(CHEMBL3427203)
Affinity DataIC50:  3.20E+3nM. Assay description: Inhibition of LPS-induced COX2 in human whole blood assessed as reduction in PGH2 levels by radioimmunoassay
In DepthDetails ArticlePubMed
TargetProstaglandin G/H synthase 2(Homo sapiens (Human))
Universit£
Curated by ChEMBL
LigandPNGBDBM50084631(CHEMBL3427203)
Affinity DataIC50:  1.00E+3nM. Assay description: Inhibition of human COX2
In DepthDetails PubMed
TargetProstaglandin G/H synthase 2(Homo sapiens (Human))
Universit£
Curated by ChEMBL
LigandPNGBDBM50084631(CHEMBL3427203)
Affinity DataIC50:  3.20E+3nM. Assay description: Inhibition of COX2 (unknown origin)
In DepthDetails ArticlePubMed
TargetProstaglandin G/H synthase 1(Homo sapiens (Human))
Universit£
Curated by ChEMBL
LigandPNGBDBM50084631(CHEMBL3427203)
Affinity DataIC50:  5nM. Assay description: Inhibition of human COX1
In DepthDetails PubMed
TargetProstaglandin G/H synthase 1(Homo sapiens (Human))
Universit£
Curated by ChEMBL
LigandPNGBDBM50084631(CHEMBL3427203)
Affinity DataIC50:  5nM. Assay description: Inhibition of COX1 (unknown origin)
In DepthDetails ArticlePubMed