BDBM50085253 1-[2-(4-Benzyl-2-fluoro-phenoxy)-ethyl]-pyrrolidine::CHEMBL162624
SMILES Fc1cc(Cc2ccccc2)ccc1OCCN1CCCC1
InChI Key InChIKey=SFZIUDIOAVNNBZ-UHFFFAOYSA-N
Data  2 IC50
  Tab Delimited (TSV)   2D SDfile   Computed 3D by Vconf -m prep SDfile
Find this compound or compounds like it in BindingDB:
Activity Spreadsheet -- Enzyme Inhibition Constant Data from BindingDB
Found 2 hits for monomerid = 50085253
TargetLeukotriene A-4 hydrolase(Homo sapiens (Human))
Searle Research And Development
Curated by ChEMBL
LigandPNGBDBM50085253(1-[2-(4-Benzyl-2-fluoro-phenoxy)-ethyl]-pyrrolidin...)
Affinity DataIC50:  60nM. Assay description: Inhibitory activity was determined against Leukotriene A4 hydrolase
In DepthDetails ArticlePubMed
TargetLeukotriene A-4 hydrolase(Homo sapiens (Human))
Searle Research And Development
Curated by ChEMBL
LigandPNGBDBM50085253(1-[2-(4-Benzyl-2-fluoro-phenoxy)-ethyl]-pyrrolidin...)
Affinity DataIC50:  190nM. Assay description: Inhibitory activity was determined for LTB4 production in human whole blood.
In DepthDetails ArticlePubMed