BDBM50085301 5-[4-(2-Pyrrolidin-1-yl-ethoxy)-benzyl]-thiazole::CHEMBL349672
SMILES C(CN1CCCC1)Oc1ccc(Cc2cncs2)cc1
InChI Key InChIKey=CUOVSRHGTNJBTE-UHFFFAOYSA-N
Data  2 IC50
  Tab Delimited (TSV)   2D SDfile   Computed 3D by Vconf -m prep SDfile
Find this compound or compounds like it in BindingDB:
Activity Spreadsheet -- Enzyme Inhibition Constant Data from BindingDB
Found 2 hits for monomerid = 50085301
TargetLeukotriene A-4 hydrolase(Homo sapiens (Human))
Searle Research And Development
Curated by ChEMBL
LigandPNGBDBM50085301(5-[4-(2-Pyrrolidin-1-yl-ethoxy)-benzyl]-thiazole |...)
Affinity DataIC50:  220nM. Assay description: Inhibitory activity was determined for LTB4 production in human whole blood.
In DepthDetails ArticlePubMed
TargetLeukotriene A-4 hydrolase(Homo sapiens (Human))
Searle Research And Development
Curated by ChEMBL
LigandPNGBDBM50085301(5-[4-(2-Pyrrolidin-1-yl-ethoxy)-benzyl]-thiazole |...)
Affinity DataIC50:  77nM. Assay description: Inhibitory activity was determined against Leukotriene A4 hydrolase
In DepthDetails ArticlePubMed