BDBM50085305 1-{2-[4-(3-Chloro-benzyl)-phenoxy]-ethyl}-pyrrolidine::CHEMBL162161
SMILES Clc1cccc(Cc2ccc(OCCN3CCCC3)cc2)c1
InChI Key InChIKey=WQOXEIBBJRNKMC-UHFFFAOYSA-N
Data  2 IC50
  Tab Delimited (TSV)   2D SDfile   Computed 3D by Vconf -m prep SDfile
Find this compound or compounds like it in BindingDB:
Activity Spreadsheet -- Enzyme Inhibition Constant Data from BindingDB
Found 2 hits for monomerid = 50085305
TargetLeukotriene A-4 hydrolase(Homo sapiens (Human))
Searle Research And Development
Curated by ChEMBL
LigandPNGBDBM50085305(1-{2-[4-(3-Chloro-benzyl)-phenoxy]-ethyl}-pyrrolid...)
Affinity DataIC50:  160nM. Assay description: Inhibitory activity was determined for LTB4 production in human whole blood.
In DepthDetails ArticlePubMed
TargetLeukotriene A-4 hydrolase(Homo sapiens (Human))
Searle Research And Development
Curated by ChEMBL
LigandPNGBDBM50085305(1-{2-[4-(3-Chloro-benzyl)-phenoxy]-ethyl}-pyrrolid...)
Affinity DataIC50:  80nM. Assay description: Inhibitory activity was determined against Leukotriene A4 hydrolase
In DepthDetails ArticlePubMed