BDBM50085311 1-[2-(4-Phenylsulfanylmethyl-phenoxy)-ethyl]-pyrrolidine::CHEMBL162835
SMILES C(CN1CCCC1)Oc1ccc(CSc2ccccc2)cc1
InChI Key InChIKey=IVKOPRQSHYRLAV-UHFFFAOYSA-N
Data  2 IC50
  Tab Delimited (TSV)   2D SDfile   Computed 3D by Vconf -m prep SDfile
Find this compound or compounds like it in BindingDB:
Activity Spreadsheet -- Enzyme Inhibition Constant Data from BindingDB
Found 2 hits for monomerid = 50085311
TargetLeukotriene A-4 hydrolase(Homo sapiens (Human))
Searle Research And Development
Curated by ChEMBL
LigandPNGBDBM50085311(1-[2-(4-Phenylsulfanylmethyl-phenoxy)-ethyl]-pyrro...)
Affinity DataIC50:  67nM. Assay description: Inhibitory activity was determined against Leukotriene A4 hydrolase
In DepthDetails ArticlePubMed
TargetLeukotriene A-4 hydrolase(Homo sapiens (Human))
Searle Research And Development
Curated by ChEMBL
LigandPNGBDBM50085311(1-[2-(4-Phenylsulfanylmethyl-phenoxy)-ethyl]-pyrro...)
Affinity DataIC50:  190nM. Assay description: Inhibitory activity was determined for LTB4 production in human whole blood.
In DepthDetails ArticlePubMed