BDBM50085418 3-(3,5-dibromo-4-hydroxybenzylidene)-5-(cyclopropanecarbonyl)indolin-2-one::5-Cyclopropanecarbonyl-3-[1-(3,5-dibromo-4-hydroxy-phenyl)-meth-(Z)-ylidene]-1,3-dihydro-indol-2-one::CHEMBL75988
SMILES Oc1c(Br)cc(C=C2C(=O)Nc3ccc(cc23)C(=O)C2CC2)cc1Br
InChI Key InChIKey=GAQBUFAKKWTZTI-UHFFFAOYSA-N
Data  2 IC50
  Tab Delimited (TSV)   2D SDfile   Computed 3D by Vconf -m prep SDfile
Find this compound or compounds like it in BindingDB:
Activity Spreadsheet -- Enzyme Inhibition Constant Data from BindingDB
Found 2 hits for monomerid = 50085418
TargetRAF proto-oncogene serine/threonine-protein kinase(Homo sapiens (Human))
China Pharmaceutical University
Curated by ChEMBL
LigandPNGBDBM50085418(3-(3,5-dibromo-4-hydroxybenzylidene)-5-(cyclopropa...)
Affinity DataIC50:  25nM. Assay description: Inhibition of Raf1 kinase
In DepthDetails ArticlePubMed
TargetRAF proto-oncogene serine/threonine-protein kinase(Homo sapiens (Human))
China Pharmaceutical University
Curated by ChEMBL
LigandPNGBDBM50085418(3-(3,5-dibromo-4-hydroxybenzylidene)-5-(cyclopropa...)
Affinity DataIC50:  25nM. Assay description: Inhibition of cRaf1 kinase in cascade assay
In DepthDetails ArticlePubMed