BDBM50087125 CHEMBL3426640
SMILES COCCOC(=O)c1ccc(F)c(c1)C(=O)Nc1cccc(c1)-c1cc(ccc1CN)C(=O)Nc1ccncc1F
InChI Key InChIKey=WCHCYBGLVMXBGU-UHFFFAOYSA-N
Data  2 IC50
  Tab Delimited (TSV)   2D SDfile   Computed 3D by Vconf -m prep SDfile
Find this compound or compounds like it in BindingDB:
Activity Spreadsheet -- Enzyme Inhibition Constant Data from BindingDB
Found 2 hits for monomerid = 50087125
TargetRho-associated protein kinase 2(Homo sapiens (Human))
Agoralaan Abis
Curated by ChEMBL
LigandPNGBDBM50087125(CHEMBL3426640)
Affinity DataIC50: <1nM. Assay description: Inhibition of human N-terminal GST-tagged ROCK2 expressed in baculovirus-infected insect cells using long S6 kinase peptide as substrate by radiometr...
In DepthDetails ArticlePubMed
TargetRho-associated protein kinase 2(Homo sapiens (Human))
Agoralaan Abis
Curated by ChEMBL
LigandPNGBDBM50087125(CHEMBL3426640)
Affinity DataIC50:  2.20nM. Assay description: Inhibition of human N-terminal GST-tagged ROCK2 expressed in baculovirus-infected insect cells using long S6 kinase peptide as substrate by radiometr...
In DepthDetails ArticlePubMed