BDBM50087296 2-(4-Bromo-benzyl)-6-(8-hydroxy-7,8-dihydro-6H-imidazo[4,5-d][1,3]diazepin-3-yl)-hexanoic acid 1.25H2O::CHEMBL289052
SMILES OC1CNC=Nc2c1ncn2CCCCC(Cc1ccc(Br)cc1)C(O)=O
InChI Key InChIKey=ZMELRSSTECEKFZ-UHFFFAOYSA-N
Data  2 KI
  Tab Delimited (TSV)   2D SDfile   Computed 3D by Vconf -m prep SDfile
Find this compound or compounds like it in BindingDB:
Activity Spreadsheet -- Enzyme Inhibition Constant Data from BindingDB
Found 2 hits for monomerid = 50087296
TargetAMP deaminase 2(Homo sapiens (Human))
Metabasis Therapeutics
Curated by ChEMBL
LigandPNGBDBM50087296(2-(4-Bromo-benzyl)-6-(8-hydroxy-7,8-dihydro-6H-imi...)
Affinity DataKi:  1.10E+3nM. Assay description: Evaluated for the inhibition of porcine heart or human L-type Adenosine 5'-monophosphate deaminase (AMPDA)
In DepthDetails ArticlePubMed
TargetAdenosine deaminase(Bos taurus (bovine))
Metabasis Therapeutics
Curated by ChEMBL
LigandPNGBDBM50087296(2-(4-Bromo-benzyl)-6-(8-hydroxy-7,8-dihydro-6H-imi...)
Affinity DataKi: >7.50E+3nM. Assay description: Evaluated for the inhibition of calf intestinal Adenosine deaminase (ADA)
In DepthDetails ArticlePubMed